{"text_format":"1","workbook":"xlsx","n_sheets":7,"sheets":["I","II","III","IV","V","VI","PODSUMOWANIE"],"not_rendered":{"charts":0,"images":4,"macros":1,"external_links":0,"defined_names":0,"comments":0,"pivot_tables":0},"unopened":[],"bounds":{"document_bytes":16777216,"sheet_cells":100000,"rows_first":2000,"rows_last":500,"rows_between":2000,"halvings":0,"cell_chars":16384,"cell_head_chars":4096},"cells_cut":0,"cells_raw":0,"read":"whole","date_system":"1900"}

{"sheet":"I","index":0,"n_rows":18,"n_cols":12,"rows_kept":18,"cut":false,"hidden":false,"merged":[[1,3,1,6]]}
[]
[null,null,null,"Nawigacja i opcje"]
[]
[null,null,null,"Liczba odpowiedzi na \"TAK\"",null,null,"X"]
[]
["Nr.","Pytanie",null,null,null,null,null,null,null,null,"tak","nie"]
[1,"Umiem przejść do ostatniej komórki"]
[2,"Umiem skopiować arkusz i zmienić jego nazwę"]
[3,"Umiem zarządzać paskiem szybkiego dostępu"]
[4,"Wiem, czym jest i umiem włączyć tryb obliczeń „dokładność zgodna z wyświetlaną”"]
[5,"Umiem zarządzać makrami /uruchamieć, usuwać, dodawać do paska szybkiego dostępu itp./"]
[6,"Umiem zablokować okno lub dokonać podziału okna"]
[7,"Korzystam z pola nazwy do aktywowana określonej komórki"]
[8,"Umiem przełączać opcje obliczeń na automatyczne lub ręczne"]
[9,"Umiem wyłączyć automatyczną aktualizację łączy"]
[10,"Umiem włączyć kartę Deweloper na Wstążce"]
[11,"Umiem dołączać do Excela dodatki VBA i korzystać z ich funkcji"]
[12,"Korzystam z polecenia śledź poprzedniki"]

{"sheet":"II","index":1,"n_rows":18,"n_cols":12,"rows_kept":18,"cut":false,"hidden":false,"merged":[[1,3,1,6]]}
[]
[null,null,null,"Edycja"]
[]
[null,null,null,"Liczba odpowiedzi na \"TAK\"",null,null,"X"]
[]
["Nr.","Pytanie",null,null,null,null,null,null,null,null,"tak","nie"]
[1,"Umiem wstawić komórkę"]
[2,"Umiem skopiować komentarz"]
[3,"Używam opcji kopiowania specjalnego /np. kopiując wartość formuł/"]
[4,"Korzystam z polecenia Znajdź i polecenia Zamień"]
[5,"Umiem tworzyć serie danych /np. dni robocze, kolejne liczby parzyste itp./"]
[6,"Umiem zastąpić /nadpisać/ formułę jej wartością"]
[7,"Umiem wpisać datę i godzinę w formacie Excela"]
[8,"Umiem wykonać transpozycję danych"]
[9,"Umiem wyczyść zawartość komórki bez usuwania formatu"]
[10,"Umiem wybrać komórki zawierające tylko formuły"]
[11,"Umiem scalać komórki"]
[12,"Umiem łamać tekst wenątrz komórki"]

{"sheet":"III","index":2,"n_rows":18,"n_cols":12,"rows_kept":18,"cut":false,"hidden":false,"merged":[[1,3,1,6]]}
[]
[null,null,null,"Obliczenia"]
[]
[null,null,null,"Liczba odpowiedzi na \"TAK\"",null,null,"X"]
[]
["Nr.","Pytanie",null,null,null,null,null,null,null,null,"tak","nie"]
[1,"Umiem zagnieżdżać funkcje"]
[2,"Korzystam z funkcji logicznej JEŻELI()"]
[3,"Korzystam z innych funkcji logicznych /np. ORAZ()/"]
[4,"Znam funkcje SUMA.JEŻELI() i SUMA.WARUNKÓW()"]
[5,"Stosuje niektóre funkcje tekstowe"]
[6,"Stosuje niektóre funkcje wyszukiwania i adresu"]
[7,"Umiem tworzyć nazwy dla obszarów i stosować je w formułach"]
[8,"Potrafię tworzyć formuły odwołujące się do różnych arkuszy i zeszytów"]
[9,"Znam matematyczne funkcje zaokrąglające"]
[10,"Znam zasady dotyczące kolejności wykonywania operacji arytmetycznych"]
[11,"Umiem wprowadzić formułę tablicową"]
[12,"Umiem wykonać obliczenie oparte na iteracji"]

{"sheet":"IV","index":3,"n_rows":18,"n_cols":12,"rows_kept":18,"cut":false,"hidden":false,"merged":[[1,3,1,6]]}
[]
[null,null,null,"Praca z listami"]
[]
[null,null,null,"Liczba odpowiedzi na \"TAK\"",null,null,"X"]
[]
["Nr.","Pytanie",null,null,null,null,null,null,null,null,"tak","nie"]
[1,"Umiem zastosować filtrowanie zaawansowane"]
[2,"Korzystam z Autofiltru niestandardowego"]
[3,"Umiem utworzyć tabelę przestawną"]
[4,"Umiem dodać do tabeli przestawnej pole obliczeniowe i element obliczeniowy"]
[5,"Umiem utworzyć sumy częściowe"]
[6,"Stosuje sortowanie wg kolorów"]
[7,"Umiem zaimportować tabelę z bazy Access"]
[8,"Umiem zaimportować dane z pliku tekstowego"]
[9,"Umiem stworzyć kwerendę do strony WWW i ustawić jej właściwości"]
[10,"Umiem podzielić tekst zawarty w jednej kolumnie na osobne kolumny"]
[11,"Umiem utworzyć Autokonspekt i nim zarządzać"]
[12,"Konwertuje zwykłe listy danych na tabele i wiem do czego służy w nich wiersz sumy"]

{"sheet":"V","index":4,"n_rows":18,"n_cols":12,"rows_kept":18,"cut":false,"hidden":false,"merged":[[1,3,1,6]]}
[]
[null,null,null,"Wizualizacja"]
[]
[null,null,null,"Liczba odpowiedzi na \"TAK\"",null,null,"X"]
[]
["Nr.","Pytanie",null,null,null,null,null,null,null,null,"tak","nie"]
[1,"Umiem stosować formatowanie warunkowe"]
[2,"Stosuję formatowanie warunkowe oparte na formułach"]
[3,"Umiem zmienić kolejność wykonywania reguł w formacie warunkowym"]
[4,"Tworzę własne formaty dla liczb /format niestandardowy/"]
[5,"Posługuję się malarzem formatów do kopiowania formatów"]
[6,"Umiem na wykresie dodać lub usunąć serię danych"]
[7,"Umiem stworzyć wykres typu kołowy kołowego z kryterium procentowym podziału danych"]
[8,"Wiem, czym się różni format księgowy od walutowego"]
[9,"Umiem stworzyć wykres słupkowy skumulowany"]
[10,"Umiem scalać style"]
[11,"Umiem zastosować format ułamkowy lub naukowy"]
[12,"Umiem zapisać tekst w komórce pod określonym kątem"]

{"sheet":"VI","index":5,"n_rows":18,"n_cols":12,"rows_kept":18,"cut":false,"hidden":false,"merged":[[1,3,1,6]]}
[]
[null,null,null,"Polecenia i narzędzia"]
[]
[null,null,null,"Liczba odpowiedzi na \"TAK\"",null,null,"X"]
[]
["Nr.","Pytanie",null,null,null,null,null,null,null,null,"tak","nie"]
[1,"Umiem zarejestrować makro"]
[2,"Wiem, na czym polega różnica w trybach rejestracji makra względnym i bezwzględny"]
[3,"Stosuje narzędzie inspekcji formuł Szacuj formułę"]
[4,"Umiem skorzystać z narzędzia Konsoliduj"]
[5,"Umiem zastosować narzędzie Szukaj wyniku"]
[6,"Korzystam z niektórych narzędzi Analizy danych /np. Korelacja lub Średnia ruchoma/"]
[7,"Umiem chronić hasłem dostęp do określonego obszaru w arkusza"]
[8,"Umiem przygotować stopkę i nagłówek przed drukowaniem skoroszytu"]
[9,"Umiem ukryć formuły zawarte w komórkach"]
[10,"Umiem śledzić zmiany w udostępnionym skoroszycie"]
[11,"Umiem usunąć duplikaty na liście danych"]
[12,"Umiem scalić scenariusze"]

{"sheet":"PODSUMOWANIE","index":6,"n_rows":9,"n_cols":10,"rows_kept":9,"cut":false,"hidden":false,"merged":[[8,3,8,6],[2,3,2,6],[3,3,3,6],[4,3,4,6],[5,3,5,6],[6,3,6,6],[7,3,7,6]]}
[]
[]
[null,null,null,"Nawigacja i opcje",null,null,null,{"$f":"IF(I!G4=\"X\",\"brak danych\",I!G4/12)","v":"brak danych"},null,"NASZ KOMENTARZ"]
[null,null,null,"Edycja",null,null,null,{"$f":"IF(II!G4=\"X\",\"brak danych\",II!G4/12)","v":"brak danych"}]
[null,null,null,"Obliczenia",null,null,null,{"$f":"IF(III!G4=\"X\",\"brak danych\",III!G4/12)","v":"brak danych"},null,"Dla wyniku łącznego poniżej 25% rekomendujemy szkolenie podstawowe"]
[null,null,null,"Praca z listami",null,null,null,{"$f":"IF(IV!G4=\"X\",\"brak danych\",IV!G4/12)","v":"brak danych"}]
[null,null,null,"Wizualizacja",null,null,null,{"$f":"IF(V!G4=\"X\",\"brak danych\",V!G4/12)","v":"brak danych"},null,"Dla wyniku powyżej 75% rekomendujemy szkolenie zaawansowane"]
[null,null,null,"Polecenia i narzędzia",null,null,null,{"$f":"IF(VI!G4=\"X\",\"brak danych\",VI!G4/12)","v":"brak danych"}]
[null,null,null,"PROCENT ODPOWIEDZI \n\"TAK\" OGÓŁEM",null,null,null,{"$f":"IF(COUNT(I!G4,II!G4,III!G4,IV!G4,V!G4,VI!G4)=0,\"BRAK DANYCH\",SUM(I!G4,II!G4,III!G4,IV!G4,V!G4,VI!G4)/72)","v":"BRAK DANYCH"},null,"Dla wyniku pomiędzy 25% a 75% rekomendujemy szkolenie średniozaawansowane"]